Target
Orotidine 5'-phosphate decarboxylase
Ligand
BDBM83761
Substrate
Meas. Tech.
Luminescence-based cell-based high throughput dose response assay for activators of the GAA850 frataxin (FXN) promoter
EC50
>59641±n/a nM
Citation
 PubChem, PC Luminescence-based cell-based high throughput dose response assay for activators of the GAA850 frataxin (FXN) promoter PubChem Bioassay (2011)[AID] 
Target
Name:
Orotidine 5'-phosphate decarboxylase
Synonyms:
FXN frataxin pyrA | pyrG
Type:
Enzyme Catalytic Domain
Mol. Mass.:
30195.13
Organism:
Aspergillus niger
Description:
gi_2395
Residue:
277
  
Inhibitor
Name:
BDBM83761
Synonyms:
2-[[2-[benzenesulfonyl(methyl)amino]benzoyl]amino]-N-propylbenzamide 2-[[2-[methyl(phenylsulfonyl)amino]phenyl]carbonylamino]-N-propyl-benzamide 2-[methyl(phenylsulfonyl)amino]-N-{2-[(propylamino)carbonyl]phenyl}benzamide SMR000199929 | cid_2208841
Type:
Small organic molecule
Emp. Form.:
C24H25N3O4S
Mol. Mass.:
451.538
SMILES:
CCCNC(=O)c1ccccc1NC(=O)c1ccccc1N(C)S(=O)(=O)c1ccccc1
: