Target
Orotidine 5'-phosphate decarboxylase
Ligand
BDBM50474
Substrate
Meas. Tech.
Luminescence-based cell-based high throughput dose response assay for activators of the GAA850 frataxin (FXN) promoter
EC50
>59632±n/a nM
Citation
 PubChem, PC Luminescence-based cell-based high throughput dose response assay for activators of the GAA850 frataxin (FXN) promoter PubChem Bioassay (2011)[AID] 
Target
Name:
Orotidine 5'-phosphate decarboxylase
Synonyms:
FXN frataxin pyrA | pyrG
Type:
Enzyme Catalytic Domain
Mol. Mass.:
30195.13
Organism:
Aspergillus niger
Description:
gi_2395
Residue:
277
  
Inhibitor
Name:
BDBM50474
Synonyms:
6-bromo-4-[(dimethylamino)methyl]-5-hydroxy-1-methyl-2-[(p-tolylthio)methyl]indole-3-carboxylic acid ethyl ester;hydrate;hydrochloride MLS000714376 cid_16192590 ethyl 6-bromo-4-[(dimethylamino)methyl]-5-hydroxy-1-methyl-2-[(4-methylphenyl)sulfanylmethyl]indole-3-carboxylate;hydrate;hydrochloride
Type:
Small organic molecule
Emp. Form.:
C23H27BrN2O3S
Mol. Mass.:
491.441
SMILES:
CCOC(=O)c1c(CSc2ccc(C)cc2)n(C)c2cc(Br)c(O)c(CN(C)C)c12
: