Target
Apoptotic protease-activating factor 1
Ligand
BDBM42209
Substrate
Meas. Tech.
Dose response confirmation of uHTS hits for Apaf-1 in a Fluorescent assay
IC50
1660±n/a nM
Citation
 PubChem, PC Dose response confirmation of uHTS hits for Apaf-1 in a Fluorescent assay PubChem Bioassay (2011)[AID] 
Target
Name:
Apoptotic protease-activating factor 1
Synonyms:
APAF1 Apoptotic peptidase activating factor 1 | KIAA0413
Type:
Enzyme Catalytic Domain
Mol. Mass.:
141834.40
Organism:
Homo sapiens (Human)
Description:
O14727
Residue:
1248
  
Inhibitor
Name:
BDBM42209
Synonyms:
MLS000532824 N-[(1,3-diketoindan-2-ylidene)amino]benzamide N-[(1,3-dioxoinden-2-ylidene)amino]benzamide SMR000140262 | cid_871656
Type:
Small organic molecule
Emp. Form.:
C16H10N2O3
Mol. Mass.:
278.2622
SMILES:
O=C(NN=c1c(=O)c2ccccc2c1=O)c1ccccc1
: