Target
Apoptotic protease-activating factor 1
Ligand
BDBM40316
Substrate
Meas. Tech.
Dose Response validation of Inhibitors of Apaf-1 using a Fluorescent Interference Counterscreen assay
IC50
>100000±0 nM
Citation
 PubChem, PC Dose Response validation of Inhibitors of Apaf-1 using a Fluorescent Interference Counterscreen assay PubChem Bioassay (2011)[AID] 
Target
Name:
Apoptotic protease-activating factor 1
Synonyms:
APAF1 Apoptotic peptidase activating factor 1 | KIAA0413
Type:
Enzyme Catalytic Domain
Mol. Mass.:
141834.40
Organism:
Homo sapiens (Human)
Description:
O14727
Residue:
1248
  
Inhibitor
Name:
BDBM40316
Synonyms:
8-bromo-2,3-dimethyl-4,5-dioxo-1-benzo[e]indolecarboxylic acid ethyl ester MLS000548053 cid_1736381 ethyl 8-bromo-2,3-dimethyl-4,5-dioxo-4,5-dihydro-3H-benzo[e]indole-1-carboxylate | ethyl 8-bromo-2,3-dimethyl-4,5-dioxobenzo[e]indole-1-carboxylate
Type:
Small organic molecule
Emp. Form.:
C17H14BrNO4
Mol. Mass.:
376.201
SMILES:
CCOC(=O)c1c(C)n(C)c2c1-c1cc(Br)ccc1C(=O)C2=O
: