Target
Apoptotic protease-activating factor 1
Ligand
BDBM35362
Substrate
Meas. Tech.
Dose Response validation of Inhibitors of Apaf-1 using a Fluorescent Interference Counterscreen assay
IC50
>100000±0 nM
Citation
 PubChem, PC Dose Response validation of Inhibitors of Apaf-1 using a Fluorescent Interference Counterscreen assay PubChem Bioassay (2011)[AID] 
Target
Name:
Apoptotic protease-activating factor 1
Synonyms:
APAF1 Apoptotic peptidase activating factor 1 | KIAA0413
Type:
Enzyme Catalytic Domain
Mol. Mass.:
141834.40
Organism:
Homo sapiens (Human)
Description:
O14727
Residue:
1248
  
Inhibitor
Name:
BDBM35362
Synonyms:
5-bromanyl-N-(3-cyano-1-phenyl-pyrrolo[3,2-b]quinoxalin-2-yl)furan-2-carboxamide 5-bromo-N-(3-cyano-1-phenyl-pyrrolo[3,2-b]quinoxalin-2-yl)-2-furamide MLS000068756 cid_658921
Type:
Small organic molecule
Emp. Form.:
C22H12BrN5O2
Mol. Mass.:
458.267
SMILES:
Brc1ccc(o1)C(=O)Nc1c(C#N)c2nc3ccccc3nc2n1-c1ccccc1
: