Target
Apoptotic protease-activating factor 1
Ligand
BDBM61666
Substrate
Meas. Tech.
Dose Response confirmation of uHTS Activators of the Apaf-1 Pathway in Fluorescent format
EC50
7820±n/a nM
Citation
 PubChem, PC Dose Response confirmation of uHTS Activators of the Apaf-1 Pathway in Fluorescent format PubChem Bioassay (2011)[AID] 
Target
Name:
Apoptotic protease-activating factor 1
Synonyms:
APAF1 Apoptotic peptidase activating factor 1 | KIAA0413
Type:
Enzyme Catalytic Domain
Mol. Mass.:
141834.40
Organism:
Homo sapiens (Human)
Description:
O14727
Residue:
1248
  
Inhibitor
Name:
BDBM61666
Synonyms:
(5Z)-5-[(4-keto-5,7-dimethyl-chromen-3-yl)methylene]-2-thioxo-4-imidazolidinone (5Z)-5-[(5,7-dimethyl-4-oxo-1-benzopyran-3-yl)methylidene]-2-sulfanylidene-4-imidazolidinone 5-[(5,7-dimethyl-4-oxo-4H-chromen-3-yl)methylene]-2-thioxo-4-imidazolidinone SMR000115588 | cid_1818305
Type:
Small organic molecule
Emp. Form.:
C15H12N2O3S
Mol. Mass.:
300.332
SMILES:
Cc1cc(C)c2c(c1)occ(\C=C1/NC(=S)NC1=O)c2=O
: