Target
Apoptotic protease-activating factor 1
Ligand
BDBM61293
Substrate
Meas. Tech.
Dose Response confirmation of uHTS Activators of the Apaf-1 Pathway in Fluorescent format
EC50
10400±n/a nM
Citation
 PubChem, PC Dose Response confirmation of uHTS Activators of the Apaf-1 Pathway in Fluorescent format PubChem Bioassay (2011)[AID] 
Target
Name:
Apoptotic protease-activating factor 1
Synonyms:
APAF1 Apoptotic peptidase activating factor 1 | KIAA0413
Type:
Enzyme Catalytic Domain
Mol. Mass.:
141834.40
Organism:
Homo sapiens (Human)
Description:
O14727
Residue:
1248
  
Inhibitor
Name:
BDBM61293
Synonyms:
4-(carbamoylamino)benzoic acid [2-(2-methoxy-4-nitroanilino)-2-oxoethyl] ester MLS000402248 [2-(2-methoxy-4-nitroanilino)-2-oxoethyl] 4-(carbamoylamino)benzoate cid_3372465
Type:
Small organic molecule
Emp. Form.:
C17H16N4O7
Mol. Mass.:
388.3315
SMILES:
COc1cc(ccc1NC(=O)COC(=O)c1ccc(NC(N)=O)cc1)[N+]([O-])=O
: