Target
Apoptotic protease-activating factor 1
Ligand
BDBM84005
Substrate
Meas. Tech.
Dose Response confirmation of uHTS Activators of the Apaf-1 Pathway in Fluorescent format
EC50
9930±n/a nM
Citation
 PubChem, PC Dose Response confirmation of uHTS Activators of the Apaf-1 Pathway in Fluorescent format PubChem Bioassay (2011)[AID] 
Target
Name:
Apoptotic protease-activating factor 1
Synonyms:
APAF1 Apoptotic peptidase activating factor 1 | KIAA0413
Type:
Enzyme Catalytic Domain
Mol. Mass.:
141834.40
Organism:
Homo sapiens (Human)
Description:
O14727
Residue:
1248
  
Inhibitor
Name:
BDBM84005
Synonyms:
(6R,7R)-7-[[2-(2-amino-1,3-thiazol-4-yl)-2-(carboxymethoxyimino)acetyl]amino]-3-ethenyl-8-oxo-5-thia-1-azabicyclo[4.2.0]oct-2-ene-2-carboxylic acid;hydrate (6R,7R)-7-[[2-(2-aminothiazol-4-yl)-2-(carboxymethyloximino)acetyl]amino]-8-keto-3-vinyl-5-thia-1-azabicyclo[4.2.0]oct-2-ene-2-carboxylic acid;hydrate CEFIXIME TRIHYDRATE SMR000469225 | cid_23581806
Type:
Small organic molecule
Emp. Form.:
C16H15N5O7S2
Mol. Mass.:
453.45
SMILES:
Nc1nc(cs1)C(=NOCC(O)=O)C(=O)N[C@H]1[C@H]2SCC(C=C)=C(N2C1=O)C(O)=O
: