Target
Caspase-9
Ligand
BDBM40313
Substrate
Meas. Tech.
Dose response confirmation of uHTS hits for Apaf-1 using a LZ-Caspase-9/Caspase-3 Fluorescent Selectivity assay
IC50
685±n/a nM
Citation
 PubChem, PC Dose response confirmation of uHTS hits for Apaf-1 using a LZ-Caspase-9/Caspase-3 Fluorescent Selectivity assay PubChem Bioassay (2011)[AID] 
Target
Name:
Caspase-9
Synonyms:
Apoptotic protease-activating factor 1/Caspase-3/Caspase-9/Cytochrome c CASP-9 CASP9_HUMAN ICE-like apoptotic protease 6 caspase-9 isoform alpha preproprotein
Type:
Enzyme
Mol. Mass.:
46277.29
Organism:
Homo sapiens (Human)
Description:
Residue:
416
  
Inhibitor
Name:
BDBM40313
Synonyms:
3-phenyl-9,10-phenanthrenedione 3-phenylphenanthrene-9,10-quinone SMR000115581 | cid_9549141
Type:
Small organic molecule
Emp. Form.:
C20H12O2
Mol. Mass.:
284.3081
SMILES:
O=C1C(=O)c2ccc(cc2-c2ccccc12)-c1ccccc1
: