Target
Apoptotic protease-activating factor 1
Ligand
BDBM50202151
Substrate
Meas. Tech.
Dose Response validation of Activators of Apaf-1 using a Fluorescent Interference Counterscreen assay
EC50
>100000±0 nM
Citation
 PubChem, PC Dose Response validation of Activators of Apaf-1 using a Fluorescent Interference Counterscreen assay PubChem Bioassay (2011)[AID] 
Target
Name:
Apoptotic protease-activating factor 1
Synonyms:
APAF1 Apoptotic peptidase activating factor 1 | KIAA0413
Type:
Enzyme Catalytic Domain
Mol. Mass.:
141834.40
Organism:
Homo sapiens (Human)
Description:
O14727
Residue:
1248
  
Inhibitor
Name:
BDBM50202151
Synonyms:
3-(5-(3,4-bis(benzyloxy)benzylidene)-4-oxo-2-thioxothiazolidin-3-yl)propanoic acid cid_24677765
Type:
Small organic molecule
Emp. Form.:
C27H23NO5S2
Mol. Mass.:
505.605
SMILES:
OC(=O)CCN1C(=S)S\C(=C\c2ccc(OCc3ccccc3)c(OCc3ccccc3)c2)C1=O
: