Target
Sentrin-specific protease 8
Ligand
BDBM84039
Substrate
Meas. Tech.
SAR Analysis of small molecule inhibitors of Sentrin-specific protease 8 (SENP8) using a Luminescent assay - Set 2
IC50
4900±n/a nM
Citation
 PubChem, PC SAR Analysis of small molecule inhibitors of Sentrin-specific protease 8 (SENP8) using a Luminescent assay - Set 2 PubChem Bioassay (2011)[AID] 
Target
Name:
Sentrin-specific protease 8
Synonyms:
DEN1 PRSC2 SENP8_HUMAN | SUMO/sentrin specific peptidase family member 8
Type:
Enzyme Catalytic Domain
Mol. Mass.:
24104.52
Organism:
Homo sapiens (Human)
Description:
gi_262118306
Residue:
212
  
Inhibitor
Name:
BDBM84039
Synonyms:
MLS-0454427.0001 N-(6-butyl-1,3-benzothiazol-2-yl)-2-thiazolecarboxamide cid_49852521
Type:
Small organic molecule
Emp. Form.:
C15H15N3OS2
Mol. Mass.:
317.429
SMILES:
CCCCc1ccc2nc(NC(=O)c3nccs3)sc2c1
: