Target
Sentrin-specific protease 8
Ligand
BDBM84048
Substrate
Meas. Tech.
SAR Analysis of small molecule inhibitors of Sentrin-specific protease 8 (SENP8) using a Luminescent assay - Set 2
IC50
1810±n/a nM
Citation
 PubChem, PC SAR Analysis of small molecule inhibitors of Sentrin-specific protease 8 (SENP8) using a Luminescent assay - Set 2 PubChem Bioassay (2011)[AID] 
Target
Name:
Sentrin-specific protease 8
Synonyms:
DEN1 PRSC2 SENP8_HUMAN | SUMO/sentrin specific peptidase family member 8
Type:
Enzyme Catalytic Domain
Mol. Mass.:
24104.52
Organism:
Homo sapiens (Human)
Description:
gi_262118306
Residue:
212
  
Inhibitor
Name:
BDBM84048
Synonyms:
5-[(E)-2-(4-fluorophenyl)ethenyl]-3-phenyl-1,2,4-oxadiazole MLS-0454348.0002 | cid_19324407
Type:
Small organic molecule
Emp. Form.:
C16H11FN2O
Mol. Mass.:
266.2697
SMILES:
Fc1ccc(\C=C\c2nc(no2)-c2ccccc2)cc1
: