Target
Sentrin-specific protease 8
Ligand
BDBM84089
Substrate
Meas. Tech.
SAR Analysis of small molecule inhibitors of Sentrin-specific protease 8 (SENP8) using a Luminescent assay - Set 2
IC50
>99000±n/a nM
Citation
 PubChem, PC SAR Analysis of small molecule inhibitors of Sentrin-specific protease 8 (SENP8) using a Luminescent assay - Set 2 PubChem Bioassay (2011)[AID] 
Target
Name:
Sentrin-specific protease 8
Synonyms:
DEN1 PRSC2 SENP8_HUMAN | SUMO/sentrin specific peptidase family member 8
Type:
Enzyme Catalytic Domain
Mol. Mass.:
24104.52
Organism:
Homo sapiens (Human)
Description:
gi_262118306
Residue:
212
  
Inhibitor
Name:
BDBM84089
Synonyms:
MLS-0454660.0002 N-[4-[[[(Z)-(2-methylindol-3-ylidene)methyl]amino]carbamoyl]phenyl]butanamide cid_6504314
Type:
Small organic molecule
Emp. Form.:
C21H22N4O2
Mol. Mass.:
362.425
SMILES:
CCCC(=O)Nc1ccc(cc1)C(=O)NN=Cc1c(C)[nH]c2ccccc12
: