Target
Multidrug resistance protein CDR1
Ligand
BDBM84130
Substrate
Meas. Tech.
Dose Response HTS singleplex for inhibitors of yeast efflux pump, specifically Cdr1 with Hit compounds from Cherry Pick1
EC50
514±n/a nM
Citation
 PubChem, PC Dose Response HTS singleplex for inhibitors of yeast efflux pump, specifically Cdr1 with Hit compounds from Cherry Pick1 PubChem Bioassay (2011)[AID] 
Target
Name:
Multidrug resistance protein CDR1
Synonyms:
CDR1 Multidrug resistance protein CDR1 | drug resistance protein 1
Type:
PROTEIN
Mol. Mass.:
169942.67
Organism:
Candida albicans
Description:
ChEMBL_708756
Residue:
1501
  
Inhibitor
Name:
BDBM84130
Synonyms:
(E)-3-(2-chlorophenyl)-N-(2-phenylethyl)-2-propenamide (E)-3-(2-chlorophenyl)-N-phenethyl-acrylamide MLS000575531 cid_700599
Type:
Small organic molecule
Emp. Form.:
C17H16ClNO
Mol. Mass.:
285.768
SMILES:
Clc1ccccc1\C=C\C(=O)NCCc1ccccc1
: