Target
Potassium voltage-gated channel subfamily KQT member 2
Ligand
BDBM84167
Substrate
Meas. Tech.
Dose response assay for compounds that inhibit KCNQ2 potassium channels on automated electrophysiological assay II
IC50
1488.42±175.49 nM
Citation
 PubChem, PC Dose response assay for compounds that inhibit KCNQ2 potassium channels on automated electrophysiological assay II PubChem Bioassay (2011)[AID] 
Target
Name:
Potassium voltage-gated channel subfamily KQT member 2
Synonyms:
KCNQ2_RAT Voltage-gated potassium channel subunit Kv7.2 | potassium voltage-gated channel, KQT-like subfamily, member 2
Type:
PROTEIN
Mol. Mass.:
93984.01
Organism:
Rattus norvegicus
Description:
EBI_100117
Residue:
852
  
Inhibitor
Name:
BDBM84167
Synonyms:
MLS000579971 N-cyclohexyl-2-(4-fluorophenoxy)-N-(2-pyridinyl)acetamide N-cyclohexyl-2-(4-fluorophenoxy)-N-2-pyridinylacetamide SMR000199212 | cid_975732
Type:
Small organic molecule
Emp. Form.:
C19H21FN2O2
Mol. Mass.:
328.3806
SMILES:
Fc1ccc(OCC(=O)N(C2CCCCC2)c2ccccn2)cc1
: