Target
Potassium voltage-gated channel subfamily KQT member 2
Ligand
BDBM84171
Substrate
Meas. Tech.
Dose response assay for compounds that inhibit KCNQ2 potassium channels on automated electrophysiological assay II
IC50
110.27±54.04 nM
Citation
 PubChem, PC Dose response assay for compounds that inhibit KCNQ2 potassium channels on automated electrophysiological assay II PubChem Bioassay (2011)[AID] 
Target
Name:
Potassium voltage-gated channel subfamily KQT member 2
Synonyms:
KCNQ2_RAT Voltage-gated potassium channel subunit Kv7.2 | potassium voltage-gated channel, KQT-like subfamily, member 2
Type:
PROTEIN
Mol. Mass.:
93984.01
Organism:
Rattus norvegicus
Description:
EBI_100117
Residue:
852
  
Inhibitor
Name:
BDBM84171
Synonyms:
MLS000516664 N-(2-morpholinophenyl)-2-(3,4,5-trimethoxyphenyl)cinchoninamide SMR000342833 | cid_2366328
Type:
Small organic molecule
Emp. Form.:
C29H29N3O5
Mol. Mass.:
499.5577
SMILES:
COc1cc(cc(OC)c1OC)-c1cc(C(=O)Nc2ccccc2N2CCOCC2)c2ccccc2n1
: