Target
Beta-2 adrenergic receptor
Ligand
BDBM54208
Substrate
Meas. Tech.
Dose response for HTS for Beta-2AR agonists via FAP method from CP1
EC50
8090±n/a nM
Citation
 PubChem, PC Dose response for HTS for Beta-2AR agonists via FAP method from CP1 PubChem Bioassay (2011)[AID] 
Target
Name:
Beta-2 adrenergic receptor
Synonyms:
ADRB2 ADRB2_HUMAN Beta-2 adrenoceptor | Beta-2 adrenoreceptor
Type:
Mol. Mass.:
46461.69
Organism:
Homo sapiens (Human)
Description:
P07550
Residue:
413
  
Inhibitor
Name:
BDBM54208
Synonyms:
1-methyl-N-[5-methyl-4-(4-methylphenyl)-1,3-thiazol-2-yl]-4-nitro-pyrazole-3-carboxamide 1-methyl-N-[5-methyl-4-(4-methylphenyl)-2-thiazolyl]-4-nitro-3-pyrazolecarboxamide 4-nitro-1-methyl-N-[5-methyl-4-(4-methylphenyl)-1,3-thiazol-2-yl]-1H-pyrazole-3-carboxamide SMR000160092 | cid_998685
Type:
Small organic molecule
Emp. Form.:
C16H15N5O3S
Mol. Mass.:
357.387
SMILES:
Cc1sc(NC(=O)c2nn(C)cc2[N+]([O-])=O)nc1-c1ccc(C)cc1
: