Target
Beta-2 adrenergic receptor
Ligand
BDBM84259
Substrate
Meas. Tech.
Dose response for HTS for Beta-2AR agonists via FAP method from CP1
EC50
5270±n/a nM
Citation
 PubChem, PC Dose response for HTS for Beta-2AR agonists via FAP method from CP1 PubChem Bioassay (2011)[AID] 
Target
Name:
Beta-2 adrenergic receptor
Synonyms:
ADRB2 ADRB2_HUMAN Beta-2 adrenoceptor | Beta-2 adrenoreceptor
Type:
Mol. Mass.:
46461.69
Organism:
Homo sapiens (Human)
Description:
P07550
Residue:
413
  
Inhibitor
Name:
BDBM84259
Synonyms:
2-(4-chloro-3-nitro-benzoyl)benzoic acid [2-(3-cyanoanilino)-2-keto-ethyl] ester MLS000390963 [2-(3-cyanoanilino)-2-oxoethyl] 2-(4-chloro-3-nitrobenzoyl)benzoate cid_2350847
Type:
Small organic molecule
Emp. Form.:
C23H14ClN3O6
Mol. Mass.:
463.827
SMILES:
[O-][N+](=O)c1cc(ccc1Cl)C(=O)c1ccccc1C(=O)OCC(=O)Nc1cccc(c1)C#N
: