Target
Beta-2 adrenergic receptor
Ligand
BDBM82688
Substrate
Meas. Tech.
Dose response for HTS for Beta-2AR agonists via FAP method from Powderset1
EC50
712.7±n/a nM
Citation
 PubChem, PC Dose response for HTS for Beta-2AR agonists via FAP method from Powderset1 PubChem Bioassay (2011)[AID] 
Target
Name:
Beta-2 adrenergic receptor
Synonyms:
ADRB2 ADRB2_HUMAN Beta-2 adrenoceptor | Beta-2 adrenoreceptor
Type:
Mol. Mass.:
46461.69
Organism:
Homo sapiens (Human)
Description:
P07550
Residue:
413
  
Inhibitor
Name:
BDBM82688
Synonyms:
MLS000580535 N-[4-[5-(2-furyl)-1,3,4-oxadiazol-2-yl]phenyl]-2-(p-tolylthio)acetamide N-[4-[5-(furan-2-yl)-1,3,4-oxadiazol-2-yl]phenyl]-2-(4-methylphenyl)sulfanylacetamide SMR000199423 | cid_1288829
Type:
Small organic molecule
Emp. Form.:
C21H17N3O3S
Mol. Mass.:
391.443
SMILES:
Cc1ccc(SCC(=O)Nc2ccc(cc2)-c2nnc(o2)-c2ccco2)cc1
: