Target
Catechol O-methyltransferase
Ligand
BDBM84475
Substrate
Meas. Tech.
Radiochemical Assay
Temperature
310.15±0 K
IC50
9±0.0 nM
Citation
 Paulini, RLerner, CJakob-Roetne, RZürcher, GBorroni, EDiederich, F Bisubstrate inhibitors of the enzyme catechol O-methyltransferase (COMT): efficient inhibition despite the lack of a nitro group. Chembiochem 5:1270-4 (2004)  
Target
Name:
Catechol O-methyltransferase
Synonyms:
COMT_RAT Catechol-O-methyltransferase | Comt
Type:
Enzyme
Mol. Mass.:
29594.09
Organism:
Rattus norvegicus (Rat)
Description:
Residue:
264
  
Inhibitor
Name:
BDBM84475
Synonyms:
Bi-substrate Inhibitor, 1a
Type:
Small organic molecule
Emp. Form.:
C19H19N7O8
Mol. Mass.:
473.3963
SMILES:
Nc1ncnc2n(cnc12)[C@@H]1O[C@H](\C=C\CNC(=O)c2cc(cc(O)c2O)N(=O)=O)[C@@H](O)[C@H]1O
: