Target
Alpha-mannosidase 2
Ligand
BDBM50088627
Substrate
Meas. Tech.
Inhibition Assay
Ki
2.65e+5±n/a nM
Citation
 Kuntz, DAZhong, WGuo, JRose, DRBoons, GJ The molecular basis of inhibition of Golgi alpha-mannosidase II by mannostatin A. Chembiochem 10:268-77 (2009)  
Target
Name:
Alpha-mannosidase 2
Synonyms:
Alpha-mannosidase 2 Golgi alpha-mannosidase II alpha-Man-IIa
Type:
Protein
Mol. Mass.:
126735.79
Organism:
Drosophila melanogaster (Fruit fly)
Description:
Q24451
Residue:
1108
  
Inhibitor
Name:
BDBM50088627
Synonyms:
(1S,2S,3R,4R)-4-Amino-cyclopentane-1,2,3-triol CHEMBL268037 | Mannostatin analogue, 3
Type:
Small organic molecule
Emp. Form.:
C5H11NO3
Mol. Mass.:
133.1457
SMILES:
N[C@@H]1C[C@H](O)[C@H](O)[C@@H]1O
: