Target
Gamma-aminobutyric acid receptor subunit alpha-1
Ligand
BDBM50001728
Substrate
Ki
21±n/a nM
Comments
PDSP_275
Citation
 Giusti, PDucić, IPuia, GArban, RWalser, AGuidotti, ACosta, E Imidazenil: a new partial positive allosteric modulator of gamma-aminobutyric acid (GABA) action at GABAA receptors. J Pharmacol Exp Ther 266:1018-28 (1993) Target
Name:
Gamma-aminobutyric acid receptor subunit alpha-1
Synonyms:
Benzodiazepine central GABA A Benzodiazepine GABA A Benzodiazepine Type II GABA A Benzodiazepine Type IIM GABA A Benzodiazepine omega2 GABA A alpha1 GABA receptor alpha-1 subunit GABA-PICROTOXIN Gabra-1 TBPS
Type:
Enzyme
Mol. Mass.:
51770.21
Organism:
Rattus norvegicus (Rat)
Description:
P62813
Residue:
455
  
Inhibitor
Name:
BDBM50001728
Synonyms:
8-Chloro-1-methyl-6-phenyl-4H-s-triazolo(4,3-a)(1,4)benzodiazepine ALPRAZOLAM Xanax
Type:
Small organic molecule
Emp. Form.:
C17H13ClN4
Mol. Mass.:
308.765
SMILES:
Cc1nnc2CN=C(c3ccccc3)c3cc(Cl)ccc3-n12
: