Target
Choline/ethanolamine kinase
Ligand
BDBM50239117
Substrate
Meas. Tech.
ChEMBL_1665291 (CHEMBL4015087)
IC50
>50000±n/a nM
Citation
 Barlaam, BCosulich, SDegorce, SEllston, RFitzek, MGreen, SHancox, ULambert-van der Brempt, CLohmann, JJMaudet, MMorgentin, RPlé, PWard, LWarin, N Discovery of a series of 8-(1-phenylpyrrolidin-2-yl)-6-carboxamide-2-morpholino-4H-chromen-4-one as PI3K?/? inhibitors for the treatment of PTEN-deficient tumours. Bioorg Med Chem Lett 27:1949-1954 (2017)  
Target
Name:
Choline/ethanolamine kinase
Synonyms:
CHETK CHKB_HUMAN CK CKEKB Choline kinase-like protein EKB Ethanolamine kinase beta | choline/ethanolamine kinase beta
Type:
PROTEIN
Mol. Mass.:
45262.79
Organism:
Homo sapiens (Human)
Description:
ChEMBL_108033
Residue:
395
  
Inhibitor
Name:
BDBM50239117
Synonyms:
CHEMBL4060768
Type:
Small organic molecule
Emp. Form.:
C28H29F2N3O5
Mol. Mass.:
525.5438
SMILES:
Fc1cc(F)cc(c1)N1CCC[C@@H]1c1cc(cc2c1oc(cc2=O)N1CCOCC1)C(=O)N1CCOCC1
: