Target
Potassium voltage-gated channel subfamily H member 2
Ligand
BDBM50239117
Substrate
Meas. Tech.
ChEMBL_1665270 (CHEMBL4015066)
IC50
45000±n/a nM
Citation
 Barlaam, BCosulich, SDegorce, SEllston, RFitzek, MGreen, SHancox, ULambert-van der Brempt, CLohmann, JJMaudet, MMorgentin, RPlé, PWard, LWarin, N Discovery of a series of 8-(1-phenylpyrrolidin-2-yl)-6-carboxamide-2-morpholino-4H-chromen-4-one as PI3K?/? inhibitors for the treatment of PTEN-deficient tumours. Bioorg Med Chem Lett 27:1949-1954 (2017)  
Target
Name:
Potassium voltage-gated channel subfamily H member 2
Synonyms:
1,3-beta-glucan synthase component GLS2 ERG Eag-related protein 1 Ether-a-go-go-related gene (HERG) Ether-a-go-go-related gene potassium channel 1 Ether-a-go-go-related gene potassium channel 1 (hERG1) Ether-a-go-go-related protein 1 H-ERG KCNH2 Potassium voltage-gated channel subfamily H member 2 (hERG) Voltage-gated potassium channel subunit Kv11.1 hERG Potassium Channel 1 | putative potassium channel subunit
Type:
Multi-pass membrane protein
Mol. Mass.:
126672.65
Organism:
Homo sapiens (Human)
Description:
Q12809
Residue:
1159
  
Inhibitor
Name:
BDBM50239117
Synonyms:
CHEMBL4060768
Type:
Small organic molecule
Emp. Form.:
C28H29F2N3O5
Mol. Mass.:
525.5438
SMILES:
Fc1cc(F)cc(c1)N1CCC[C@@H]1c1cc(cc2c1oc(cc2=O)N1CCOCC1)C(=O)N1CCOCC1
: