Target
Nucleotide-binding oligomerization domain-containing protein 2
Ligand
BDBM50239696
Substrate
Meas. Tech.
ChEMBL_1666701 (CHEMBL4016497)
IC50
1190±n/a nM
Citation
 Wang, SYang, JLi, XLiu, ZWu, YSi, GTao, YZhao, NHu, XMa, YLiu, G Discovery of 1,4-Benzodiazepine-2,5-dione (BZD) Derivatives as Dual Nucleotide Binding Oligomerization Domain Containing 1/2 (NOD1/NOD2) Antagonists Sensitizing Paclitaxel (PTX) To Suppress Lewis Lung Carcinoma (LLC) Growth in Vivo. J Med Chem 60:5162-5192 (2017)  
Target
Name:
Nucleotide-binding oligomerization domain-containing protein 2
Synonyms:
CARD15 IBD1 NOD2 Nucleotide-binding oligomerization domain-containing protein 2 | nucleotide-binding oligomerization domain containing 2
Type:
PROTEIN
Mol. Mass.:
115287.18
Organism:
Homo sapiens (Human)
Description:
ChEMBL_1454053
Residue:
1040
  
Inhibitor
Name:
BDBM50239696
Synonyms:
CHEMBL4067528
Type:
Small organic molecule
Emp. Form.:
C30H31BrN4O7
Mol. Mass.:
639.494
SMILES:
COC(=O)CC[C@H]1NC(=O)c2cc(Oc3cccc(c3)N(C)C)c(NC(=O)COCc3ccc(Br)cc3)cc2NC1=O
: