Target
Bile salt export pump
Ligand
BDBM50029764
Substrate
Meas. Tech.
ChEMBL_1667662 (CHEMBL4017550)
IC50
>1000000±n/a nM
Citation
 Warner, DJChen, HCantin, LDKenna, JGStahl, SWalker, CLNoeske, T Mitigating the inhibition of human bile salt export pump by drugs: opportunities provided by physicochemical property modulation, in silico modeling, and structural modification. Drug Metab Dispos 40:2332-41 (2012)  
Target
Name:
Bile salt export pump
Synonyms:
ABCB11 ATP-binding cassette sub-family B member 11 Bile Salt Export Pump, BSEP Bile salt export pump (BSEP)
Type:
Protein
Mol. Mass.:
146405.49
Organism:
Homo sapiens (Human)
Description:
O95342
Residue:
1321
  
Inhibitor
Name:
BDBM50029764
Synonyms:
1,1'-sulfonylbis(4-aminobenzene) 4,4'-dapsone 4,4'-sulfonylbisaniline 4-aminophenyl sulfone CHEMBL1043 DAPSONE Diaphenylsulfone p,p-sulphonylbisbenzamine p-aminophenyl sulfone
Type:
Small organic molecule
Emp. Form.:
C12H12N2O2S
Mol. Mass.:
248.301
SMILES:
Nc1ccc(cc1)S(=O)(=O)c1ccc(N)cc1
: