Target
Bile salt export pump
Ligand
BDBM50007260
Substrate
Meas. Tech.
ChEMBL_1667662 (CHEMBL4017550)
IC50
>1000000±n/a nM
Citation
 Warner, DJChen, HCantin, LDKenna, JGStahl, SWalker, CLNoeske, T Mitigating the inhibition of human bile salt export pump by drugs: opportunities provided by physicochemical property modulation, in silico modeling, and structural modification. Drug Metab Dispos 40:2332-41 (2012)  
Target
Name:
Bile salt export pump
Synonyms:
ABCB11 ATP-binding cassette sub-family B member 11 Bile Salt Export Pump, BSEP Bile salt export pump (BSEP)
Type:
Protein
Mol. Mass.:
146405.49
Organism:
Homo sapiens (Human)
Description:
O95342
Residue:
1321
  
Inhibitor
Name:
BDBM50007260
Synonyms:
2,6-Di-tert-butyl-4-[1-(3,5-di-tert-butyl-4-hydroxy-phenylsulfanyl)-1-methyl-ethylsulfanyl]-phenol 2,6-di(tert-butyl)-4-{1-[3,5-di(tert-butyl)-4-hydroxyphenylsulfanyl]-1-methylethylsulfanyl}phenol(probucol) CHEMBL608 Lorelco US9182402, 14
Type:
Small organic molecule
Emp. Form.:
C31H48O2S2
Mol. Mass.:
516.842
SMILES:
CC(C)(Sc1cc(c(O)c(c1)C(C)(C)C)C(C)(C)C)Sc1cc(c(O)c(c1)C(C)(C)C)C(C)(C)C
: