Target
Bile salt export pump
Ligand
BDBM39342
Substrate
Meas. Tech.
ChEMBL_1667662 (CHEMBL4017550)
IC50
>1000000±n/a nM
Citation
 Warner, DJChen, HCantin, LDKenna, JGStahl, SWalker, CLNoeske, T Mitigating the inhibition of human bile salt export pump by drugs: opportunities provided by physicochemical property modulation, in silico modeling, and structural modification. Drug Metab Dispos 40:2332-41 (2012)  
Target
Name:
Bile salt export pump
Synonyms:
ABCB11 ATP-binding cassette sub-family B member 11 Bile Salt Export Pump, BSEP Bile salt export pump (BSEP)
Type:
Protein
Mol. Mass.:
146405.49
Organism:
Homo sapiens (Human)
Description:
O95342
Residue:
1321
  
Inhibitor
Name:
BDBM39342
Synonyms:
2-aminocarbonyloxypropyl(trimethyl)azanium;chloride 2-carbamoyloxypropyl(trimethyl)azanium;chloride BETHANECHOL CHLORIDE Hermes, Myo Myotonine cid_11548
Type:
Small organic molecule
Emp. Form.:
C7H17N2O2
Mol. Mass.:
161.2215
SMILES:
CC(C[N+](C)(C)C)OC(N)=O
: