Target
Meprin A subunit alpha
Ligand
BDBM50240415
Substrate
Meas. Tech.
ChEMBL_1668163 (CHEMBL4018051)
IC50
3290±n/a nM
Citation
 Ramsbeck, DHamann, ASchlenzig, DSchilling, SBuchholz, M First insight into structure-activity relationships of selective meprin? inhibitors. Bioorg Med Chem Lett 27:2428-2431 (2017)  
Target
Name:
Meprin A subunit alpha
Synonyms:
3.4.24.18 MEP1A Meprin A subunit alpha PABA peptide hydrolase | PPH alpha
Type:
PROTEIN
Mol. Mass.:
84405.87
Organism:
Homo sapiens
Description:
ChEMBL_117380
Residue:
746
  
Inhibitor
Name:
BDBM50240415
Synonyms:
CHEMBL4078433
Type:
Small organic molecule
Emp. Form.:
C17H18N2O7S
Mol. Mass.:
394.399
SMILES:
COc1ccc(cc1)S(=O)(=O)N(CC(=O)NO)Cc1cccc(c1)C(O)=O
: