Target
Kappa-type opioid receptor
Ligand
BDBM50240938
Substrate
Meas. Tech.
ChEMBL_1669356 (CHEMBL4019244)
Ki
0.017000±n/a nM
Citation
 Erli, FGuerrieri, EBen Haddou, TLantero, AMairegger, MSchmidhammer, HSpetea, M Highly Potent and Selective New Diphenethylamines Interacting with the?-Opioid Receptor: Synthesis, Pharmacology, and Structure-Activity Relationships. J Med Chem 60:7579-7590 (2017)  
Target
Name:
Kappa-type opioid receptor
Synonyms:
K-OR-1 Kappa-opioid receptor (KOR) Kappa-type opioid receptor (KOR) OPIATE Kappa OPRK1 kappa opioid receptor (KOR)
Type:
G Protein-Coupled Receptor (GPCR)
Mol. Mass.:
42648.76
Organism:
Homo sapiens (Human)
Description:
P41145
Residue:
380
  
Inhibitor
Name:
BDBM50240938
Synonyms:
CHEMBL4071862
Type:
Small organic molecule
Emp. Form.:
C22H30ClNO
Mol. Mass.:
359.933
SMILES:
Cl.Oc1cccc(CCN(CCc2ccccc2)CC2CCCC2)c1
: