Target
Glycogen phosphorylase, muscle form
Ligand
BDBM50241633
Substrate
Meas. Tech.
ChEMBL_1670149 (CHEMBL4020037)
Ki
3110±n/a nM
Citation
 Bokor, ÉKyriakis, ESolovou, TGAKoppány, CKantsadi, ALSzabó, KESzakács, AStravodimos, GADocsa, TSkamnaki, VTZographos, SEGergely, PLeonidas, DDSomsák, L Nanomolar Inhibitors of Glycogen Phosphorylase Based on?-d-Glucosaminyl Heterocycles: A Combined Synthetic, Enzyme Kinetic, and Protein Crystallography Study. J Med Chem 60:9251-9262 (2017)  
Target
Name:
Glycogen phosphorylase, muscle form
Synonyms:
Glycogen Phosphorylase (PYGM) Glycogen phosphorylase, muscle form PYGM | PYGM_RABIT
Type:
Enzyme
Mol. Mass.:
97296.32
Organism:
Oryctolagus cuniculus (rabbit)
Description:
Phosphorylation of Ser-15 converts phosphorylase B (unphosphorylated) to phosphorylase A.
Residue:
843
  
Inhibitor
Name:
BDBM50241633
Synonyms:
CHEMBL4095486
Type:
Small organic molecule
Emp. Form.:
C15H19N3O4
Mol. Mass.:
305.3291
SMILES:
N[C@@H]1[C@@H](O)[C@H](O)[C@@H](CO)O[C@H]1c1nc(c[nH]1)-c1ccccc1
: