Target
Acetylcholinesterase
Ligand
BDBM50011780
Substrate
Meas. Tech.
ChEMBL_1676704 (CHEMBL4026847)
Kd
3159000±n/a nM
Citation
 de Koning, MCJoosen, MJAWorek, FNachon, Fvan Grol, MKlaassen, SDAlkema, DPWWille, Tde Bruijn, HM Application of the Ugi Multicomponent Reaction in the Synthesis of Reactivators of Nerve Agent Inhibited Acetylcholinesterase. J Med Chem 60:9376-9392 (2017)  
Target
Name:
Acetylcholinesterase
Synonyms:
ACES_HUMAN Acetylcholinesterase (AChE) | Acetylcholinesterase (human AChE)
Type:
Enzyme
Mol. Mass.:
67792.70
Organism:
Homo sapiens (Human)
Description:
P22303
Residue:
614
  
Inhibitor
Name:
BDBM50011780
Synonyms:
2-[(E)-(hydroxyimino)methyl]-1-methylpyridinium chloride PRALIDOXIME Pralidoxine chloride
Type:
Small organic molecule
Emp. Form.:
C7H9N2O
Mol. Mass.:
137.1586
SMILES:
C[n+]1ccccc1CN=O
: