Target
Aromatase
Ligand
BDBM50398447
Substrate
Meas. Tech.
ChEMBL_1672252 (CHEMBL4022281)
IC50
43±n/a nM
Citation
 Yamaguchi, YNishizono, NKobayashi, DYoshimura, TWada, KOda, K Evaluation of synthesized coumarin derivatives on aromatase inhibitory activity. Bioorg Med Chem Lett 27:2645-2649 (2017)  
Target
Name:
Aromatase
Synonyms:
ARO1 CP19A_HUMAN CYP19 CYPXIX Cytochrome P450 19A1 Cytochrome P450-C19 (CYP19) FL cytokine receptor precursor | P-450AROM
Type:
Enzyme
Mol. Mass.:
57888.92
Organism:
Homo sapiens (Human)
Description:
P11511
Residue:
503
  
Inhibitor
Name:
BDBM50398447
Synonyms:
Aromasin | EXEMESTANE
Type:
Small organic molecule
Emp. Form.:
C20H24O2
Mol. Mass.:
296.4034
SMILES:
C[C@]12CC[C@H]3[C@@H](CC(=C)C4=CC(=O)C=C[C@]34C)[C@@H]1CCC2=O
: