Target
Acidic mammalian chitinase
Ligand
BDBM50243799
Substrate
Meas. Tech.
ChEMBL_1672910 (CHEMBL4022939)
IC50
5.4±n/a nM
Citation
 Mazur, MOlczak, JOlejniczak, SKoralewski, RCzestkowski, WJedrzejczak, AGolab, JDzwonek, KDymek, BSklepkiewicz, PLZagozdzon, ANoonan, TMahboubi, KConway, BSheeler, RBeckett, PHungerford, WMPodjarny, AMitschler, ACousido-Siah, AFadel, FGolebiowski, A Targeting Acidic Mammalian chitinase Is Effective in Animal Model of Asthma. J Med Chem 61:695-710 (2018)  
Target
Name:
Acidic mammalian chitinase
Synonyms:
AMCase CHIA Lung-specific protein TSA1902
Type:
Protein
Mol. Mass.:
52266.66
Organism:
Homo sapiens (Human)
Description:
Q9BZP6
Residue:
476
  
Inhibitor
Name:
BDBM50243799
Synonyms:
CHEMBL4077482
Type:
Small organic molecule
Emp. Form.:
C22H27ClN6
Mol. Mass.:
410.943
SMILES:
Nc1n[nH]c(n1)N1CCC(CC1)N(CCc1ccc(Cl)cc1)Cc1ccccc1
: