Target
5'-AMP-activated protein kinase catalytic subunit alpha-1/subunit beta-1/subunit gamma-1
Ligand
BDBM50244636
Substrate
Meas. Tech.
ChEMBL_1673933 (CHEMBL4023962)
EC50
1200±n/a nM
Citation
 Edmonds, DJKung, DWKalgutkar, ASFilipski, KJEbner, DCCabral, SSmith, ACAspnes, GEBhattacharya, SKBorzilleri, KABrown, JACalabrese, MFCaspers, NLCokorinos, ECConn, ELDowling, MSEng, HFeng, BFernando, DPGenung, NEHerr, MKurumbail, RGLavergne, SYLee, ECLi, QMathialagan, SMiller, RAPanteleev, JPolivkova, JRajamohan, FReyes, ARSalatto, CTShavnya, AThuma, BATu, MWard, JWithka, JMXiao, JCameron, KO Optimization of Metabolic and Renal Clearance in a Series of Indole Acid Direct Activators of 5'-Adenosine Monophosphate-Activated Protein Kinase (AMPK). J Med Chem 61:2372-2383 (2018)  
Target
Name:
5'-AMP-activated protein kinase catalytic subunit alpha-1/subunit beta-1/subunit gamma-1
Synonyms:
5'-AMP-activated protein kinase Complex 1 AMP-activated protein kinase (AMPK) alpha-1/beta-1/gamma-1 AMPK complex 1 (alpha-1,beta-1,gamma-1) Recombinant AMPK alpha1/beta1/gamma1 complex
Type:
Mol. Mass.:
Description:
Components:
This complex has 0 components.
Component 1
Name:
5'-AMP-activated protein kinase subunit beta-1
Synonyms:
5'-AMP-activated protein kinase subunit beta-1 AMP-activated protein kinase alpha-2/beta-1/gamma-3 AMPK subunit beta-1 PRKAB1
Type:
Mol. Mass.:
30380.94
Organism:
Homo sapiens (Human)
Description:
Q9Y478
Residue:
270
  
Component 2
Name:
5'-AMP-activated protein kinase subunit gamma-1
Synonyms:
5'-AMP-activated protein kinase subunit gamma-1 AMP-activated protein kinase, gamma-1 subunit AMPK gamma-1 AMPK subunit gamma-1 PRKAG1
Type:
Mol. Mass.:
37581.44
Organism:
Homo sapiens (Human)
Description:
P54619
Residue:
331
  
Component 3
Name:
5'-AMP-activated protein kinase catalytic subunit alpha-1
Synonyms:
AAPK1_HUMAN AMP-activated protein kinase alpha-1/beta-2/gamma-2 AMPK subunit alpha-1 AMPK1 PRKAA1 | Tau-protein kinase PRKAA1
Type:
Protein
Mol. Mass.:
64023.62
Organism:
Homo sapiens (Human)
Description:
Q13131
Residue:
559
  
Inhibitor
Name:
BDBM50244636
Synonyms:
CHEMBL4087189
Type:
Small organic molecule
Emp. Form.:
C15H11ClN2O3
Mol. Mass.:
302.712
SMILES:
COc1ccc(cn1)-c1cc2c(c[nH]c2cc1Cl)C(O)=O
: