Target
Cholinesterase
Ligand
BDBM50245729
Substrate
Meas. Tech.
ChEMBL_1675787 (CHEMBL4025930)
IC50
110000±n/a nM
Citation
 Li, QYang, HChen, YSun, H Recent progress in the identification of selective butyrylcholinesterase inhibitors for Alzheimer's disease. Eur J Med Chem 132:294-309 (2017)  
Target
Name:
Cholinesterase
Synonyms:
Acylcholine acylhydrolase Butyrylcholine esterase (BChE) Butyrylcholinesterase (BuChE) CHLE_HUMAN Cholinesterases Pseudocholinesterase
Type:
Homotetramer
Mol. Mass.:
68422.27
Organism:
Homo sapiens (Human)
Description:
P06276
Residue:
602
  
Inhibitor
Name:
BDBM50245729
Synonyms:
CHEMBL4080162
Type:
Small organic molecule
Emp. Form.:
C16H24N2O3
Mol. Mass.:
292.3734
SMILES:
COc1ccc(N[C@H]2CCC[C@H](C2)OC(=O)N(C)C)cc1
: