Target
14-3-3 protein zeta/delta
Ligand
BDBM50246079
Substrate
Meas. Tech.
ChEMBL_1676464 (CHEMBL4026607)
Kd
5900±n/a nM
Citation
 Krüger, DMGlas, ABier, DPospiech, NWallraven, KDietrich, LOttmann, CKoch, OHennig, SGrossmann, TN Structure-Based Design of Non-natural Macrocyclic Peptides That Inhibit Protein-Protein Interactions. J Med Chem 60:8982-8988 (2017)  
Target
Name:
14-3-3 protein zeta/delta
Synonyms:
14-3-3 protein zeta/delta KCIP-1 YWHAZ
Type:
PROTEIN
Mol. Mass.:
27731.18
Organism:
Homo sapiens
Description:
ChEMBL_117504
Residue:
245
  
Inhibitor
Name:
BDBM50246079
Synonyms:
CHEMBL4076293
Type:
Small organic molecule
Emp. Form.:
C89H120N16O25S
Mol. Mass.:
1846.062
SMILES:
CC(C)C[C@H](NC(=O)[C@H](CC(O)=O)NC(=O)[C@H](CC(C)C)NC(=O)[C@]1(C)CCCCCCCCCCCC[C@](C)(NC(=O)CNC(=O)[C@H](CCC(N)=O)NC(=O)COCCOCCNC(=S)Nc2ccc3c(c2)C(=O)OC32c3ccc(O)cc3Oc3cc(O)ccc23)C(=O)N[C@@H](Cc2c[nH]c3ccccc23)C(=O)N[C@@H](CC(O)=O)C(=O)N1)C(=O)N[C@@H](C)C(=O)N[C@@H](CO)C(N)=O
: