Target
Cholesterol side-chain cleavage enzyme, mitochondrial
Ligand
BDBM31768
Substrate
Meas. Tech.
ChEMBL_50353 (CHEMBL662513)
IC50
5400±n/a nM
Citation
 Rotstein, DMKertesz, DJWalker, KASwinney, DC Stereoisomers of ketoconazole: preparation and biological activity. J Med Chem 35:2818-25 (1992)  
Target
Name:
Cholesterol side-chain cleavage enzyme, mitochondrial
Synonyms:
CP11A_RAT Cyp11a-1 Cytochrome P450 11A1
Type:
PROTEIN
Mol. Mass.:
60603.33
Organism:
Rattus norvegicus
Description:
ChEMBL_50353
Residue:
526
  
Inhibitor
Name:
BDBM31768
Synonyms:
CHEMBL295698 Nizoral | Panfungol
Type:
Small organic molecule
Emp. Form.:
C26H28Cl2N4O4
Mol. Mass.:
531.431
SMILES:
CC(=O)N1CCN(CC1)c1ccc(OC[C@@H]2CO[C@](Cn3ccnc3)(O2)c2ccc(Cl)cc2Cl)cc1
: