Target
Cytochrome P450 11B1, mitochondrial
Ligand
BDBM50004441
Substrate
Meas. Tech.
ChEBML_48190
IC50
135±n/a nM
Citation
 Rotstein, DMKertesz, DJWalker, KASwinney, DC Stereoisomers of ketoconazole: preparation and biological activity. J Med Chem 35:2818-25 (1992)  
Target
Name:
Cytochrome P450 11B1, mitochondrial
Synonyms:
C11B1_BOVIN Cytochrome P450 11B1
Type:
PROTEIN
Mol. Mass.:
57863.81
Organism:
Bos taurus
Description:
ChEMBL_1345884
Residue:
503
  
Inhibitor
Name:
BDBM50004441
Synonyms:
(2R,4R)-ketoconazole CHEMBL328863
Type:
Small organic molecule
Emp. Form.:
C26H28Cl2N4O4
Mol. Mass.:
531.431
SMILES:
CC(=O)N1CCN(CC1)c1ccc(OC[C@@H]2CO[C@@](Cn3ccnc3)(O2)c2ccc(Cl)cc2Cl)cc1
: