Target
Protein arginine N-methyltransferase 3
Ligand
BDBM50247358
Substrate
Meas. Tech.
ChEMBL_1677669 (CHEMBL4027812)
IC50
22±n/a nM
Citation
 Kaniskan, HÜEram, MSZhao, KSzewczyk, MMYang, XSchmidt, KLuo, XXiao, SDai, MHe, FZang, ILin, YLi, FDobrovetsky, ESmil, DMin, SJLin-Jones, JSchapira, MAtadja, PLi, EBarsyte-Lovejoy, DArrowsmith, CHBrown, PJLiu, FYu, ZVedadi, MJin, J Discovery of Potent and Selective Allosteric Inhibitors of Protein Arginine Methyltransferase 3 (PRMT3). J Med Chem 61:1204-1217 (2018)  
Target
Name:
Protein arginine N-methyltransferase 3
Synonyms:
2.1.1.- HRMT1L3 PRMT3 | Protein arginine N-methyltransferase 3
Type:
PROTEIN
Mol. Mass.:
59886.87
Organism:
Homo sapiens
Description:
ChEMBL_101368
Residue:
531
  
Inhibitor
Name:
BDBM50247358
Synonyms:
CHEMBL4071410
Type:
Small organic molecule
Emp. Form.:
C18H22N4O2
Mol. Mass.:
326.3929
SMILES:
CC1CCC(C)N1C(=O)CNC(=O)Nc1ccc2cnccc2c1
: