Target
ATP-binding cassette sub-family C member 3
Ligand
BDBM50092098
Substrate
Meas. Tech.
ChEMBL_1678646 (CHEMBL4028923)
IC50
>133000±n/a nM
Citation
 Morgan, REvan Staden, CJChen, YKalyanaraman, NKalanzi, JDunn, RTAfshari, CAHamadeh, HK A multifactorial approach to hepatobiliary transporter assessment enables improved therapeutic compound development. Toxicol Sci 136:216-41 (2013)  
Target
Name:
ATP-binding cassette sub-family C member 3
Synonyms:
ABCC3 CMOAT2 MLP2 MRP3 Multi-specific organic anion transporter D | Multidrug resistance-associated protein 3
Type:
PROTEIN
Mol. Mass.:
169352.45
Organism:
Homo sapiens (Human)
Description:
ChEMBL_735421
Residue:
1527
  
Inhibitor
Name:
BDBM50092098
Synonyms:
CHEMBL1174 Integrilin | [22-Carbamoyl-14-(4-guanidino-butyl)-5-(1H-indol-3-ylmethyl)-4,7,10,13,16,24-hexaoxo-docosahydro-19,20-dithia-3a,6,9,12,15,23-hexaaza-cyclopentacyclotricosen-8-yl]-acetic acid (C68-22, eptifibatide)
Type:
Small organic molecule
Emp. Form.:
C35H49N11O9S2
Mol. Mass.:
831.962
SMILES:
NC(=N)NCCCC[C@@H]1NC(=O)CCSSC[C@H](NC(=O)[C@@H]2CCCN2C(=O)[C@H](Cc2c[nH]c3ccccc23)NC(=O)[C@H](CC(O)=O)NC(=O)CNC1=O)C(N)=O
: