Target
ATP-binding cassette sub-family C member 2
Ligand
BDBM24182
Substrate
Meas. Tech.
ChEMBL_1678645 (CHEMBL4028922)
IC50
>133000±n/a nM
Citation
 Morgan, REvan Staden, CJChen, YKalyanaraman, NKalanzi, JDunn, RTAfshari, CAHamadeh, HK A multifactorial approach to hepatobiliary transporter assessment enables improved therapeutic compound development. Toxicol Sci 136:216-41 (2013)  
Target
Name:
ATP-binding cassette sub-family C member 2
Synonyms:
ABCC2 CMOAT CMRP Canalicular multispecific organic anion transporter 1 MRP2 Multidrug resistance-associated protein 2 Multidrug resistance-associated protein 3 (MRP3)
Type:
Protein
Mol. Mass.:
174229.45
Organism:
Homo sapiens (Human)
Description:
Q92887
Residue:
1545
  
Inhibitor
Name:
BDBM24182
Synonyms:
4-amino-3-(4-chlorophenyl)butanoic acid Baclophen Gabalon | Lioresal
Type:
Small organic molecule
Emp. Form.:
C10H12ClNO2
Mol. Mass.:
213.661
SMILES:
NCC(CC(O)=O)c1ccc(Cl)cc1
: