Target
ATP-binding cassette sub-family C member 3
Ligand
BDBM13530
Substrate
Meas. Tech.
ChEMBL_1678646 (CHEMBL4028923)
IC50
>133000±n/a nM
Citation
 Morgan, REvan Staden, CJChen, YKalyanaraman, NKalanzi, JDunn, RTAfshari, CAHamadeh, HK A multifactorial approach to hepatobiliary transporter assessment enables improved therapeutic compound development. Toxicol Sci 136:216-41 (2013)  
Target
Name:
ATP-binding cassette sub-family C member 3
Synonyms:
ABCC3 CMOAT2 MLP2 MRP3 Multi-specific organic anion transporter D | Multidrug resistance-associated protein 3
Type:
PROTEIN
Mol. Mass.:
169352.45
Organism:
Homo sapiens (Human)
Description:
ChEMBL_735421
Residue:
1527
  
Inhibitor
Name:
BDBM13530
Synonyms:
4-[(4-methylpiperazin-1-yl)methyl]-N-[4-methyl-3-[(4-pyridin-3-ylpyrimidin-2-yl)amino]phenyl]benzamide Gleevec Imatinib, 21 STI-571 US10906896, Cpd imatinib US11725005, Compound imatinib cid_5291 med.21724, Compound 6
Type:
Small organic molecule
Emp. Form.:
C29H31N7O
Mol. Mass.:
493.6027
SMILES:
CN1CCN(Cc2ccc(cc2)C(=O)Nc2ccc(C)c(Nc3nccc(n3)-c3cccnc3)c2)CC1
: