Target
ATP-binding cassette sub-family C member 3
Ligand
BDBM50248247
Substrate
Meas. Tech.
ChEMBL_1678646 (CHEMBL4028923)
IC50
23850±n/a nM
Citation
 Morgan, REvan Staden, CJChen, YKalyanaraman, NKalanzi, JDunn, RTAfshari, CAHamadeh, HK A multifactorial approach to hepatobiliary transporter assessment enables improved therapeutic compound development. Toxicol Sci 136:216-41 (2013)  
Target
Name:
ATP-binding cassette sub-family C member 3
Synonyms:
ABCC3 CMOAT2 MLP2 MRP3 Multi-specific organic anion transporter D | Multidrug resistance-associated protein 3
Type:
PROTEIN
Mol. Mass.:
169352.45
Organism:
Homo sapiens (Human)
Description:
ChEMBL_735421
Residue:
1527
  
Inhibitor
Name:
BDBM50248247
Synonyms:
ARDF-26 Glurenorm
Type:
Small organic molecule
Emp. Form.:
C27H33N3O6S
Mol. Mass.:
527.632
SMILES:
COc1ccc2c(c1)C(=O)N(CCc1ccc(cc1)S(=O)(=O)NC(=O)NC1CCCCC1)C(=O)C2(C)C
: