Target
ATP-binding cassette sub-family C member 4
Ligand
BDBM86521
Substrate
Meas. Tech.
ChEMBL_1678647 (CHEMBL4028924)
IC50
>133000±n/a nM
Citation
 Morgan, REvan Staden, CJChen, YKalyanaraman, NKalanzi, JDunn, RTAfshari, CAHamadeh, HK A multifactorial approach to hepatobiliary transporter assessment enables improved therapeutic compound development. Toxicol Sci 136:216-41 (2013)  
Target
Name:
ATP-binding cassette sub-family C member 4
Synonyms:
ABCC4 MOAT-B MRP/cMOAT-related ABC transporter MRP4_HUMAN Multidrug resistance-associated protein 4
Type:
PROTEIN
Mol. Mass.:
149546.12
Organism:
Homo sapiens (Human)
Description:
ChEMBL_1486828
Residue:
1325
  
Inhibitor
Name:
BDBM86521
Synonyms:
CAS_5719 Zaleplon
Type:
Small organic molecule
Emp. Form.:
C17H15N5O
Mol. Mass.:
305.3339
SMILES:
CCN(C(C)=O)c1cccc(c1)-c1ccnc2c(cnn12)C#N
: