Target
Bile salt export pump
Ligand
BDBM50108877
Substrate
Meas. Tech.
ChEMBL_1678644 (CHEMBL4028921)
IC50
36600±n/a nM
Citation
 Morgan, REvan Staden, CJChen, YKalyanaraman, NKalanzi, JDunn, RTAfshari, CAHamadeh, HK A multifactorial approach to hepatobiliary transporter assessment enables improved therapeutic compound development. Toxicol Sci 136:216-41 (2013)  
Target
Name:
Bile salt export pump
Synonyms:
ABCB11 ATP-binding cassette sub-family B member 11 Bile Salt Export Pump, BSEP Bile salt export pump (BSEP)
Type:
Protein
Mol. Mass.:
146405.49
Organism:
Homo sapiens (Human)
Description:
O95342
Residue:
1321
  
Inhibitor
Name:
BDBM50108877
Synonyms:
(3,4-Dihydroxy-5-nitro-phenyl)-p-tolyl-methanone CHEMBL1324 TOLCAPONE Tasmar
Type:
Small organic molecule
Emp. Form.:
C14H11NO5
Mol. Mass.:
273.2408
SMILES:
Cc1ccc(cc1)C(=O)c1cc(O)c(O)c(c1)[N+]([O-])=O
: