Target
Bile salt export pump
Ligand
BDBM22369
Substrate
Meas. Tech.
ChEMBL_1678644 (CHEMBL4028921)
IC50
>133000±n/a nM
Citation
 Morgan, REvan Staden, CJChen, YKalyanaraman, NKalanzi, JDunn, RTAfshari, CAHamadeh, HK A multifactorial approach to hepatobiliary transporter assessment enables improved therapeutic compound development. Toxicol Sci 136:216-41 (2013)  
Target
Name:
Bile salt export pump
Synonyms:
ABCB11 ATP-binding cassette sub-family B member 11 Bile Salt Export Pump, BSEP Bile salt export pump (BSEP)
Type:
Protein
Mol. Mass.:
146405.49
Organism:
Homo sapiens (Human)
Description:
O95342
Residue:
1321
  
Inhibitor
Name:
BDBM22369
Synonyms:
4-(4-methanesulfonylphenyl)-3-phenyl-2,5-dihydrofuran-2-one MK 0966 US11478464, Compound Rofecoxib | US11786535, Compound Rofecoxib
Type:
Small organic molecule
Emp. Form.:
C17H14O4S
Mol. Mass.:
314.356
SMILES:
CS(=O)(=O)c1ccc(cc1)C1=C(C(=O)OC1)c1ccccc1
: