Target
Bile salt export pump
Ligand
BDBM50049707
Substrate
Meas. Tech.
ChEMBL_1678644 (CHEMBL4028921)
IC50
>133000±n/a nM
Citation
 Morgan, REvan Staden, CJChen, YKalyanaraman, NKalanzi, JDunn, RTAfshari, CAHamadeh, HK A multifactorial approach to hepatobiliary transporter assessment enables improved therapeutic compound development. Toxicol Sci 136:216-41 (2013)  
Target
Name:
Bile salt export pump
Synonyms:
ABCB11 ATP-binding cassette sub-family B member 11 Bile Salt Export Pump, BSEP Bile salt export pump (BSEP)
Type:
Protein
Mol. Mass.:
146405.49
Organism:
Homo sapiens (Human)
Description:
O95342
Residue:
1321
  
Inhibitor
Name:
BDBM50049707
Synonyms:
(6R,7R)-7-{2-(2-Amino-thiazol-4-yl)-2-[(Z)-methoxyimino]-acetylamino}-3-(2-methyl-5,6-dioxo-1,2,5,6-tetrahydro-[1,2,4]triazin-3-ylsulfanylmethyl)-8-oxo-5-thia-1-aza-bicyclo[4.2.0]oct-2-ene-2-carboxylic acid (6R,7R,)-7-(2-(2-aminothiazol-4-yl)-2-(methoxyimino)acetamido)-3-((2-methyl-5,6-dioxo-1,2,5,6-tetrahydro-1,2,4-triazin-3-ylthio)methyl)-8-oxo-5-thia-1-aza-bicyclo[4.2.0]oct-2-ene-2-carboxylic acid 7-[2-(2-Amino-thiazol-4-yl)-2-methoxyimino-acetylamino]-3-(6-hydroxy-2-methyl-5-oxo-2,5-dihydro-[1,2,4]triazin-3-ylsulfanylmethyl)-8-oxo-5-thia-1-aza-bicyclo[4.2.0]oct-2-ene-2-carboxylic acid (Ceftriaxone) CHEMBL161 | ceftriaxone
Type:
Small organic molecule
Emp. Form.:
C18H18N8O7S3
Mol. Mass.:
554.58
SMILES:
CO\N=C(/C(=O)N[C@H]1[C@H]2SCC(CSc3nc(=O)c(=O)[nH]n3C)=C(N2C1=O)C(O)=O)c1csc(N)n1
: