Target
ATP-binding cassette sub-family C member 3
Ligand
BDBM50031282
Substrate
Meas. Tech.
ChEMBL_1678646 (CHEMBL4028923)
IC50
>133000±n/a nM
Citation
 Morgan, REvan Staden, CJChen, YKalyanaraman, NKalanzi, JDunn, RTAfshari, CAHamadeh, HK A multifactorial approach to hepatobiliary transporter assessment enables improved therapeutic compound development. Toxicol Sci 136:216-41 (2013)  
Target
Name:
ATP-binding cassette sub-family C member 3
Synonyms:
ABCC3 CMOAT2 MLP2 MRP3 Multi-specific organic anion transporter D | Multidrug resistance-associated protein 3
Type:
PROTEIN
Mol. Mass.:
169352.45
Organism:
Homo sapiens (Human)
Description:
ChEMBL_735421
Residue:
1527
  
Inhibitor
Name:
BDBM50031282
Synonyms:
CHEBI:17630 | Kanamycin
Type:
Small organic molecule
Emp. Form.:
C18H36N4O11
Mol. Mass.:
484.4986
SMILES:
NC[C@H]1O[C@H](O[C@@H]2[C@@H](N)C[C@@H](N)[C@H](O[C@H]3O[C@H](CO)[C@@H](O)[C@H](N)[C@H]3O)[C@H]2O)[C@H](O)[C@@H](O)[C@@H]1O
: