Target
Sodium- and chloride-dependent GABA transporter 2
Ligand
BDBM50007525
Substrate
Meas. Tech.
ChEBML_1681421
IC50
>500000±n/a nM
Citation
 Jørgensen, LAl-Khawaja, AKickinger, SVogensen, SBSkovgaard-Petersen, JRosenthal, EBorkar, NLöffler, RMadsen, KKBräuner-Osborne, HSchousboe, AEcker, GFWellendorph, PClausen, RP Structure-Activity Relationship, Pharmacological Characterization, and Molecular Modeling of Noncompetitive Inhibitors of the Betaine/?-Aminobutyric Acid Transporter 1 (BGT1). J Med Chem 60:8834-8846 (2017)  
Target
Name:
Sodium- and chloride-dependent GABA transporter 2
Synonyms:
GABA transporter 2 S6A13_HUMAN | SLC6A13
Type:
PROTEIN
Mol. Mass.:
68012.63
Organism:
Homo sapiens (Human)
Description:
ChEMBL_1454197
Residue:
602
  
Inhibitor
Name:
BDBM50007525
Synonyms:
CHEMBL123282 | N-(1-Benzyl-piperidin-4-yl)-2,3-dimethoxy-benzamide
Type:
Small organic molecule
Emp. Form.:
C21H26N2O3
Mol. Mass.:
354.4427
SMILES:
COc1cccc(C(=O)NC2CCN(Cc3ccccc3)CC2)c1OC
: